user_login,user_email,source_user_id,user_pass,user_nicename,user_url,user_registered,display_name,role,nickname,first_name,last_name,description,rich_editing,syntax_highlighting,comment_shortcuts,admin_color,use_ssl,show_admin_bar_front,locale,wp_capabilities,wp_user_level,dismissed_wp_pointers,show_welcome_panel,wp_dashboard_quick_press_last_post_id,community-events-location,nav_menu_recently_edited,managenav-menuscolumnshidden,metaboxhidden_nav-menus,wp_user-settings,wp_user-settings-time,billing_first_name,billing_last_name,billing_company,billing_address_1,billing_address_2,billing_city,billing_postcode,billing_country,billing_state,billing_phone,billing_email,shipping_first_name,shipping_last_name,shipping_company,shipping_address_1,shipping_address_2,shipping_city,shipping_postcode,shipping_country,shipping_state,last_update,shipping_method,closedpostboxes_dashboard,metaboxhidden_dashboard,closedpostboxes_page,metaboxhidden_page,_woocommerce_persistent_cart_1,closedpostboxes_process_posts,metaboxhidden_process_posts,closedpostboxes_product,metaboxhidden_product,_yoast_wpseo_profile_updated,meta-box-order_product,screen_layout_product,wpseo_title,wpseo_metadesc,wpseo_metakey,wpseo_noindex_author,wpseo_content_analysis_disable,wpseo_keyword_analysis_disable,googleplus,twitter,facebook,session_tokens,edit_pf_contact_per_page,obfx_ignore_visit_dashboard_notice,dismissed_update_notice,closedpostboxes_post,metaboxhidden_post,elementor_library_remote,wp_media_library_mode,signup_ip,dismissed_product_display_settings_moved_notice,closedpostboxes_pf_form,metaboxhidden_pf_form,closedpostboxes_shop_coupon,metaboxhidden_shop_coupon,wc_last_active,tgmpa_dismissed_notice_pirate-forms,dismissed_no_secure_connection_notice,wp_wpseo-upsell-notice,show_try_gutenberg_panel,meta-box-order_post,screen_layout_post,pirate_forms_farewell_dismissed,_pum_reviews_dismissed_triggers,_pum_reviews_last_dismissed,closedpostboxes_shop_order,metaboxhidden_shop_order,elementor_admin_notices,elementor_introduction,closedpostboxes_enhancedcategory,metaboxhidden_enhancedcategory,meta-box-order_page,screen_layout_page,meta-box-order_dashboard,edit_product_per_page,jetpack_tracks_anon_id,fb_for_woo_admin_notice_dismissed,paying_customer,closedpostboxes_notification,metaboxhidden_notification,closedpostboxes_ywcm_message,metaboxhidden_ywcm_message,jetpack_tracks_wpcom_id,billing_city1,AtD_options,AtD_check_when,AtD_guess_lang,AtD_ignored_phrases,_pum_dismissed_alerts,pys_free_current_promo_notices_set,pys_free_current_promo_notice_key,pys_core_optin_first_time_dismissed_at,pys_ga_no_pixel_dismissed_at,closedpostboxes_nav-menus,pys_core_optin_second_time_dismissed_at,dismissed_woocommerce_google_analytics_pro_notice_notice,wpcf7_hide_welcome_panel_on,wp_sabai_sabai_content_viewed,pys_core_optin_third_time_dismissed_at,default_password_nag,wp_sabai_sabai_questions_reputation,_wc_plugin_framework_jilt_dismissed_messages,_wc_last_order,_order_count,_money_spent,_wc_jilt_cart_token,edit_shop_order_per_page,user_phone,closedpostboxes_sabai_content_addpost,metaboxhidden_sabai_content_addpost,instagram,linkedin,myspace,pinterest,soundcloud,tumblr,youtube,wikipedia,_woocommerce_load_saved_cart_after_login,peepso_stream_id,peepso_stream_filter_show_my_posts,peepso_user_field_gender,peepso_user_field_gender_acc,peepso_last_used_post_privacy,wp_peepso_hide_getting_started,peepso_user_field_birthdate,peepso_user_field_birthdate_acc,peepso_user_field_description_acc,peepso_user_field_user_url_acc,peepso_profile_completeness,wp_peepso_admin_verbose_fields,peepso_avatar_hash,peepso_cover_hash,peepso_asset_hash,closedpostboxes_attachment,metaboxhidden_attachment,_wc_plugin_framework_customer_order_csv_export_dismissed_messages,_wc_customer_order_csv_export_is_exported,_wc_customer_order_csv_export_notices,wp_aam_menu,wp_aam_toolbar,wp_yoast_notifications,_metorik_cart_token,closedpostboxes_wp_quiz,metaboxhidden_wp_quiz,mts_connect_dismissed_notices,shipping_phone,shipping_email,wp_woocommerce_product_import_mapping,wp_product_import_error_log,_current_woo_wallet_balance,other_first_name,other_last_name,other_phone,other_email,other_address_1,other_address_2,other_city,other_state,other_postcode,other_country,otp,other_dob,billing_prefix,billing_dob,billing_gender,shipping_dob,shipping_prefix,shipping_gender,other_prefix,other_gender,_woo_wallet_persistent_cart_1
9771417218,,"3039-04-18 09:11:43",$P$B6s8GRuc6HYiBeLLNWgmH6WW0GLz9T0,9771417218,,"2020-04-11 02:28:10",9771417218,customer,9771417218,,,,true,true,false,fresh,0,true,,"a:1:{s:8:""customer"";b:1;}",0,wp496_privacy,,,,,,,,,,,,,,,,,,,,,,,,,,,,,,,,,,,"a:1:{s:4:""cart"";a:0:{}}",,,,,1586572090,,,,,,,,,,,,"a:1:{s:64:""20654011399bf62654ecda430ee03ad8e34d23281b37315198e16ef9efca4542"";a:4:{s:10:""expiration"";i:1587781690;s:2:""ip"";s:11:""1.22.30.251"";s:2:""ua"";s:158:""Mozilla/5.0 (Linux; Android 9; SM-A105F Build/PPR1.180610.011; wv) AppleWebKit/537.36 (KHTML, like Gecko) Version/4.0 Chrome/81.0.4044.96 Mobile Safari/537.36"";s:5:""login"";i:1586572090;}}",,,,,,,,"2020-04-18 01:22:30",,,,,,"2020-04-11 00:00:00",,,,,,,,,,,,,,,,,,,,,,,,,,,,,,,,,,,,,,,,,,,,,,,,,,,,9771417218,,,,,,,,,,,,,,,,,,,,,,,,,,,,,,,,,,,,,,,,,,,50,,,,,,,,,,,,,,,,,,,,,
9821625422,,"3038-04-18 09:11:43",$P$B0nmh5VJkUkQbSL/ZKHD6gEQb6F15I1,9821625422,,"2020-04-10 07:36:32",9821625422,customer,9821625422,,,,true,true,false,fresh,0,true,,"a:1:{s:8:""customer"";b:1;}",0,wp496_privacy,,,,,,,,,,,,,,,,,,,,,,,,,,,,,,,,,,,"a:1:{s:4:""cart"";a:0:{}}",,,,,1586504192,,,,,,,,,,,,"a:1:{s:64:""48c8b759d0fde691aa71483637b08925dc495d75728c636c72997ff364c1dfc7"";a:4:{s:10:""expiration"";i:1587713792;s:2:""ip"";s:15:""203.192.207.132"";s:2:""ua"";s:150:""Mozilla/5.0 (Linux; Android 10; SAMSUNG SM-N975F) AppleWebKit/537.36 (KHTML, like Gecko) SamsungBrowser/11.1 Chrome/75.0.3770.143 Mobile Safari/537.36"";s:5:""login"";i:1586504192;}}",,,,,,,,203.192.207.132,,,,,,"2020-04-10 00:00:00",,,,,,,,,,,,,,,,,,,,,,,,,,,,,,,,,,,,,,,,,,,,,,,,,,,,9821625422,,,,,,,,,,,,,,,,,,,,,,,,,,,,,,,,,,,,,,,,,,,50,,,,,,,,,,,,,,,,,,,,,
9999424472,,"3035-04-18 09:11:43",$P$BPnTHkNFQSCBJixhdfMQ5LxMhpp3O./,9999424472,,"2020-04-04 15:15:37",9999424472,customer,9999424472,,,,true,true,false,fresh,0,true,,"a:1:{s:8:""customer"";b:1;}",0,wp496_privacy,,,,,,,,,,,,,,,,,,,,,,,,,,,,,,,,,,,"a:1:{s:4:""cart"";a:1:{s:32:""6b9183f6957cbee87835c1e1ddb72ff2"";a:11:{s:3:""key"";s:32:""6b9183f6957cbee87835c1e1ddb72ff2"";s:10:""product_id"";i:130436;s:12:""variation_id"";i:0;s:9:""variation"";a:0:{}s:8:""quantity"";i:1;s:9:""data_hash"";s:32:""b5c1d5ca8bae6d4896cf1807cdf763f0"";s:13:""line_tax_data"";a:2:{s:8:""subtotal"";a:0:{}s:5:""total"";a:0:{}}s:13:""line_subtotal"";d:3000;s:17:""line_subtotal_tax"";i:0;s:10:""line_total"";d:1500;s:8:""line_tax"";i:0;}}}",,,,,1586013337,,,,,,,,,,,,"a:1:{s:64:""a5b5ff18447f142e44ac68de0c4e770ec1b725e147b2b45c342c5466749bb31f"";a:4:{s:10:""expiration"";i:1587222937;s:2:""ip"";s:14:""171.50.183.142"";s:2:""ua"";s:65:""Mozilla/5.0 (Android 10; Mobile; rv:68.0) Gecko/68.0 Firefox/68.0"";s:5:""login"";i:1586013337;}}",,,,,,,,171.50.183.142,,,,,,"2020-04-04 00:00:00",,,,,,,,,,,,,,,,,,,,,,,,,,,,,,,,,,,,,,,,,,,,,,,,,,,,9999424472,,,,,,,,,,,,,,,,,,,,,,,,,,,,,,,,,,,,,,,,,,,50,,,,,,,,,,,,,,,,,,,,,
amitsingh.kamlakar58,amitsingh.kamlakar58@gmail.com,"3043-04-18 09:11:43",$P$BTJkh.Odq0FBwkjt6KWL7VMCxUlJql/,amitsingh-kamlakar58,,"2020-04-15 09:51:16",amitsingh.kamlakar58,customer,amitsingh.kamlakar58,Amit,Singh,,true,true,false,fresh,0,true,,"a:1:{s:8:""customer"";b:1;}",0,wp496_privacy,,,,,,,,,Amit,Singh,,"Natraj puram colony Tundli road",,Tundla,283204,IN,UP,8439086039,amitsingh.kamlakar58@gmail.com,Amit,Singh,,"Natraj puram colony Tundli road",,Tundla,283204,IN,UP,1586944486,"a:1:{i:0;s:22:""advanced_free_shipping"";}",,,,,"a:1:{s:4:""cart"";a:0:{}}",,,,,1586944280,,,,,,,,,,,,"a:1:{s:64:""1f4a3b43475f5c086b0cd721c553120fea7b8413ae95e59efd7c150db7f72d80"";a:4:{s:10:""expiration"";i:1588153892;s:2:""ip"";s:13:""106.223.146.4"";s:2:""ua"";s:124:""Mozilla/5.0 (Linux; Android 10; ASUS_Z01RD) AppleWebKit/537.36 (KHTML, like Gecko) Chrome/80.0.3987.132 Mobile Safari/537.36"";s:5:""login"";i:1586944292;}}",,,,,,,,106.223.146.4,,,,,,"2020-04-15 00:00:00",,,,,,,,,,,,,,,,,,,,,,,,,,,,,,,,,,,,,,,,,,,,,,,,,,,,,,,,,,,,,,,,,,,,,,,,,,,,,,,,,,,,,,,,,,,,,,,82.45,,,,,,,,,,,,,,,,,,,,,
anveshkonda786,anveshkonda786@gmail.com,"3041-04-18 09:11:43",$P$BzOQkctgkD.5K.L8dMCztRknvT5KGn1,anveshkonda786,,"2020-04-11 08:14:35",anveshkonda786,customer,anveshkonda786,,,,true,true,false,fresh,0,true,,"a:1:{s:8:""customer"";b:1;}",0,wp496_privacy,,,,,,,,,,,,,,,,,,,,,,,,,,,,,,,,,,,"a:1:{s:4:""cart"";a:0:{}}",,,,,1586592879,,,,,,,,,,,,"a:1:{s:64:""30889da3285cb876ba0bf5146ff73d601b9216dff6707083ad7f5ac896bc149b"";a:4:{s:10:""expiration"";i:1587802491;s:2:""ip"";s:15:""103.236.193.235"";s:2:""ua"";s:269:""Mozilla/5.0 (Linux; Android 10; GM1901 Build/QKQ1.190716.003; wv) AppleWebKit/537.36 (KHTML, like Gecko) Version/4.0 Chrome/80.0.3987.162 Mobile Safari/537.36 Instagram 135.0.0.28.119 Android (29/10; 420dpi; 1080x2134; OnePlus; GM1901; OnePlus7; qcom; en_US; 206670927)"";s:5:""login"";i:1586592891;}}",,,,,,,,103.236.193.235,,,,,,"2020-04-11 00:00:00",,,,,,,,,,,,,,,,,,,,,,,,,,,,,,,,,,,,,,,,,,"a:3:{s:5:""posts"";a:2:{i:0;i:140;i:1;i:163;}s:2:""ts"";i:1586593014;s:7:""pending"";a:0:{}}",,,,,,,,,,,,,,,,,,,,,,,,,,,,,,,,,,,,,,,,,,,,,,,,,,,,,50,,,,,,,,,,,,,,,,,,,,,
jez.w.black,jez.w.black@gmail.com,"3042-04-18 09:11:43",$P$BssfeTfw.WywGMkLfQM.rWWM/IIAvJ1,jez-w-black,,"2020-04-13 17:08:05",jez.w.black,customer,jez.w.black,,,,true,true,false,fresh,0,true,,"a:1:{s:8:""customer"";b:1;}",0,wp496_privacy,,,,,,,,,,,,,,,,,,,,,,,,,,,,,,,,,,,"a:1:{s:4:""cart"";a:1:{s:32:""9b3faf8981cc8780667e9fa12c5c4b28"";a:11:{s:3:""key"";s:32:""9b3faf8981cc8780667e9fa12c5c4b28"";s:10:""product_id"";i:12026;s:12:""variation_id"";i:0;s:9:""variation"";a:0:{}s:8:""quantity"";i:1;s:9:""data_hash"";s:32:""b5c1d5ca8bae6d4896cf1807cdf763f0"";s:13:""line_tax_data"";a:2:{s:8:""subtotal"";a:0:{}s:5:""total"";a:0:{}}s:13:""line_subtotal"";d:11500;s:17:""line_subtotal_tax"";i:0;s:10:""line_total"";d:11500;s:8:""line_tax"";i:0;}}}",,,,,1586797689,,,,,,,,,,,,"a:1:{s:64:""fd94d7adea4d4e813d5c8c535ad00f063b44c6b3c5b7cccc2af31f86fb051600"";a:4:{s:10:""expiration"";i:1588007301;s:2:""ip"";s:14:""62.216.209.119"";s:2:""ua"";s:114:""Mozilla/5.0 (Windows NT 6.3; Win64; x64) AppleWebKit/537.36 (KHTML, like Gecko) Chrome/80.0.3987.163 Safari/537.36"";s:5:""login"";i:1586797701;}}",,,,,,,,62.216.209.119,,,,,,"2020-04-14 00:00:00",,,,,,,,,,,,,,,,,,,,,,,,,,,,,,,,,,,,,,,,,,,,,,,,,,,,,,,,,,,,,,,,,,,,,,,,,,,,,,,,,,,,,,,,,,,,,,,50,,,,,,,,,,,,,,,,,,,,,
krishansoni717,krishansoni717@gmail.com,"3037-04-18 09:11:44",$P$BNZot4cui53wAy/CxBNW.Epv4DDXPv1,krishansoni717,,"2020-04-06 05:37:16",krishansoni717,customer,krishansoni717,Krishan,Soni,,true,true,false,fresh,0,true,,"a:1:{s:8:""customer"";b:1;}",0,wp496_privacy,,,,,,,,,Krishan,Soni,,,,,,,,,,,,,,,,,,,1586151517,,,,,,"a:1:{s:4:""cart"";a:0:{}}",,,,,1586151441,,,,,,,,,,,,,,,,,,,,106.204.49.134,,,,,,"2020-04-06 00:00:00",,,,,,,,,,,,,,,,,,,,,,,,,,,,,,,,,,,,,,,,,,,,,,,,,,,,,,,,,,,,,,,,,,,,,,,,,,,,,,,,,,,,,,,,,,,,,,,50,,,,,,,,,,,,,,,,,,,,,
prbhatia,prbhatia@hotmail.com,"3046-04-18 09:11:44",$P$B5j0om6rgdHksYZMEavI2Sb1N0rtv00,prbhatia,,"2020-04-17 12:28:11",prbhatia,customer,prbhatia,,,,true,true,false,fresh,0,true,,"a:1:{s:8:""customer"";b:1;}",0,wp496_privacy,,,,,,,,,,,,,,,,,,,,,,,,,,,,,,,,,,,"a:1:{s:4:""cart"";a:0:{}}",,,,,1587126496,,,,,,,,,,,,"a:1:{s:64:""71ad8770ae82dcb39c164632e4657b072036e4014fd2a1f5c4fcf986b6abb555"";a:4:{s:10:""expiration"";i:1588336110;s:2:""ip"";s:13:""70.133.216.36"";s:2:""ua"";s:115:""Mozilla/5.0 (Windows NT 10.0; Win64; x64) AppleWebKit/537.36 (KHTML, like Gecko) Chrome/79.0.3945.130 Safari/537.36"";s:5:""login"";i:1587126510;}}",,,,,,,,70.133.216.36,,,,,,"2020-04-17 00:00:00",,,,,,,,,,,,,,,,,,,,,,,,,,,,,,,,,,,,,,,,,,,,,,,,,,,,,,,,,,,,,,,,,,,,,,,,,,,,,,,,,,,,,,,,,,,,,,,50,,,,,,,,,,,,,,,,,,,,,
RakshanJamal,RakshanJamal@gmail.com,"3045-04-18 09:11:44",$P$B98.UW5rvKhvCSEVo07CJ4S0.wNcJ60,rakshanjamal,,"2020-04-17 12:04:14",RakshanJamal,customer,RakshanJamal,,,,true,true,false,fresh,0,true,,"a:1:{s:8:""customer"";b:1;}",0,wp496_privacy,,,,,,,,,,,,,,,,,,,,,,,,,,,,,,,,,,,"a:1:{s:4:""cart"";a:0:{}}",,,,,1587125059,,,,,,,,,,,,"a:1:{s:64:""9c4122a339a86cc2c41a4256ffb1053c270592181d86ecd818f472338526cd0e"";a:4:{s:10:""expiration"";i:1588334671;s:2:""ip"";s:14:""223.225.40.146"";s:2:""ua"";s:115:""Mozilla/5.0 (Windows NT 10.0; Win64; x64) AppleWebKit/537.36 (KHTML, like Gecko) Chrome/81.0.4044.113 Safari/537.36"";s:5:""login"";i:1587125071;}}",,,,,,,,223.225.40.146,,,,,,"2020-04-17 00:00:00",,,,,,,,,,,,,,,,,,,,,,,,,,,,,,,,,,,,,,,,,,,,,,,,,,,,,,,,,,,,,,,,,,,,,,,,,,,,,,,,,,,,,,,,,,,,,,,50,,,,,,,,,,,,,,,,,,,,,
ramlathsana16,ramlathsana16@gmail.com,"3040-04-18 09:11:44",$P$B0ms9tnxvidOeyoSjkrKAiDl246cWg0,ramlathsana16,,"2020-04-11 08:12:23",ramlathsana16,customer,ramlathsana16,Mohammed,Adil,,true,true,false,fresh,0,true,,"a:1:{s:8:""customer"";b:1;}",0,wp496_privacy,,,,,,,,,Mohammed,Adil,,"1503 at b block in 15 floor","Northern sky city flat Mangalore, pumpwell. ujjodi",Mangalore,575002,IN,KA,9108748856,ramlathsana16@gmail.com,Mohammed,Adil,,"1503 at b block in 15 floor","Northern sky city flat Mangalore, pumpwell. ujjodi",Mangalore,575002,IN,KA,1586592752,"a:1:{i:0;s:22:""advanced_free_shipping"";}",,,,,"a:1:{s:4:""cart"";a:0:{}}",,,,,1586592748,,,,,,,,,,,,"a:1:{s:64:""2b84cb058dcd2b45ee7d8897777bbabee843aaa24a300b9457188ae4d5b5d4c7"";a:4:{s:10:""expiration"";i:1587802352;s:2:""ip"";s:14:""223.186.233.83"";s:2:""ua"";s:121:""Mozilla/5.0 (Linux; Android 9; SM-A750F) AppleWebKit/537.36 (KHTML, like Gecko) Chrome/74.0.3729.136 Mobile Safari/537.36"";s:5:""login"";i:1586592752;}}",,,,,,,,223.186.233.83,,,,,,"2020-04-15 00:00:00",,,,,,,,,,,,,,,,,,,,,,,,,,,,,,,,,,,,,,,,,,,,,,,,,,,,,,,,,,,,,,,,,,,,,,,,,,,,,,,,,,,,,,,,,,,,,,,64.25,,,,,,,,,,,,,,,,,,,,,
ShobhitMathur,ShobhitMathur@gmail.com,"3044-04-18 09:11:44",$P$BN03DCSkmujuX.Y20pDTDIjQmD.QAW/,shobhitmathur,,"2020-04-17 11:46:36",ShobhitMathur,customer,ShobhitMathur,,,,true,true,false,fresh,0,true,,"a:1:{s:8:""customer"";b:1;}",0,wp496_privacy,,,,,,,,,,,,,,,,,,,,,,,,,,,,,,,,,,,"a:1:{s:4:""cart"";a:0:{}}",,,,,1587124001,,,,,,,,,,,,,,,,,,,,223.225.40.146,,,,,,"2020-04-17 00:00:00",,,,,,,,,,,,,,,,,,,,,,,,,,,,,,,,,,,,,,,,,,,,,,,,,,,,,,,,,,,,,,,,,,,,,,,,,,,,,,,,,,,,,,,,,,,,,,,50,,,,,,,,,,,,,,,,,,,,,
sreenivas.grandhi,sreenivas.grandhi@gmail.com,"3036-04-18 09:11:44",$P$Bj.W8odQ581uoKZ358AyhIvpvL7G6c.,sreenivas-grandhi,,"2020-04-05 12:51:03",sreenivas.grandhi,customer,sreenivas.grandhi,,,,true,true,false,fresh,0,true,,"a:1:{s:8:""customer"";b:1;}",0,wp496_privacy,,,,,,,,,,,,,,,,,,,,,,,,,,,,,,,,,,,"a:1:{s:4:""cart"";a:0:{}}",,,,,1586091068,,,,,,,,,,,,"a:1:{s:64:""ee790198cd0113c8da2df94e500de74ecf2f5aa0f7570c5ed9dcae79b3a92d9e"";a:4:{s:10:""expiration"";i:1587300679;s:2:""ip"";s:14:""223.238.82.158"";s:2:""ua"";s:139:""Mozilla/5.0 (iPhone; CPU iPhone OS 13_3_1 like Mac OS X) AppleWebKit/605.1.15 (KHTML, like Gecko) Version/13.0.5 Mobile/15E148 Safari/604.1"";s:5:""login"";i:1586091079;}}",,,,,,,,223.238.82.158,,,,,,"2020-04-11 00:00:00",,,,,,,,,,,,,,,,,,,,,,,,,,,,,,,,,,,,,,,,,,,,,,,,,,,,,,,,,,,,,,,,,,,,,,,,,,,,,,,,,,,,,,,,,,,,,,,50,,,,,,,,,,,,,,,,,,,,,
